﻿2026-08-29T06:04:56.0050229Z ##[group]Run .github/bench/wrap.ps1 -Step "twohost-cli-a" -Command "cargo test -p spt --test twohost_cli -- --nocapture"
2026-08-29T06:04:56.0050793Z [36;1m.github/bench/wrap.ps1 -Step "twohost-cli-a" -Command "cargo test -p spt --test twohost_cli -- --nocapture"[0m
2026-08-29T06:04:56.0055256Z shell: C:\Program Files\PowerShell\7\pwsh.EXE -command ". '{0}'"
2026-08-29T06:04:56.0055476Z env:
2026-08-29T06:04:56.0055743Z   SPT_CI_TEST_TMP: C:\actions-runner\_work\_temp\spt-test-tmp-33236164340-1-44de21ecab984beeb87c6691d44967e6
2026-08-29T06:04:56.0056161Z   TEMP: C:\actions-runner\_work\_temp\spt-test-tmp-33236164340-1-44de21ecab984beeb87c6691d44967e6
2026-08-29T06:04:56.0056930Z   TMP: C:\actions-runner\_work\_temp\spt-test-tmp-33236164340-1-44de21ecab984beeb87c6691d44967e6
2026-08-29T06:04:56.0057193Z   SPT_TWO_HOST: 1
2026-08-29T06:04:56.0057319Z   SPT_TWO_HOST_ROLE: a
2026-08-29T06:04:56.0057473Z   SPT_TWO_HOST_SECRET: rig-twohost-ci
2026-08-29T06:04:56.0057633Z   SPT_TWO_HOST_WAIT_SECS: 900
2026-08-29T06:04:56.0057796Z ##[endgroup]
2026-08-29T06:04:57.0447376Z    Compiling n0-future v0.3.2
2026-08-29T06:04:57.0488665Z    Compiling spt-store v0.65.0 (C:\actions-runner\_work\spt-bs-core\spt-bs-core\crates\spt-store)
2026-08-29T06:04:57.0595865Z    Compiling backon v1.6.0
2026-08-29T06:04:57.0640880Z    Compiling tempfile v3.27.0
2026-08-29T06:04:57.1487805Z    Compiling n0-watcher v0.6.1
2026-08-29T06:04:57.2286899Z    Compiling iroh-dns v0.98.0
2026-08-29T06:04:57.3194353Z    Compiling netwatch v0.16.0
2026-08-29T06:04:57.4436805Z    Compiling spt-test-support v0.65.0 (C:\actions-runner\_work\spt-bs-core\spt-bs-core\crates\spt-test-support)
2026-08-29T06:04:57.5993695Z    Compiling iroh-relay v0.98.0
2026-08-29T06:04:57.8100412Z    Compiling portmapper v0.16.0
2026-08-29T06:05:01.5208904Z    Compiling spt-msg v0.65.0 (C:\actions-runner\_work\spt-bs-core\spt-bs-core\crates\spt-msg)
2026-08-29T06:05:01.7640674Z    Compiling spt-runtime v0.65.0 (C:\actions-runner\_work\spt-bs-core\spt-bs-core\crates\spt-runtime)
2026-08-29T06:05:02.2852333Z    Compiling spt-term v0.65.0 (C:\actions-runner\_work\spt-bs-core\spt-bs-core\crates\spt-term)
2026-08-29T06:05:02.8743443Z    Compiling iroh v0.98.2
2026-08-29T06:05:04.4769503Z    Compiling spt-live v0.65.0 (C:\actions-runner\_work\spt-bs-core\spt-bs-core\crates\spt-live)
2026-08-29T06:05:14.1507054Z    Compiling spt-net v0.65.0 (C:\actions-runner\_work\spt-bs-core\spt-bs-core\crates\spt-net)
2026-08-29T06:05:16.0368595Z    Compiling spt-daemon v0.65.0 (C:\actions-runner\_work\spt-bs-core\spt-bs-core\crates\spt-daemon)
2026-08-29T06:05:32.7448739Z    Compiling spt v0.65.0 (C:\actions-runner\_work\spt-bs-core\spt-bs-core\crates\spt)
2026-08-29T06:05:44.5394514Z     Finished `test` profile [unoptimized + debuginfo] target(s) in 48.22s
2026-08-29T06:05:44.5637131Z      Running tests\twohost_cli.rs (target\debug\deps\twohost_cli-0811d73d50392ba8.exe)
2026-08-29T06:05:45.2018699Z 
2026-08-29T06:05:45.2019097Z running 2 tests
2026-08-29T06:05:45.2020987Z test gated_cli_role_b ... ok
2026-08-29T06:05:45.2027695Z GATED role A: node cc45247c71dc683e9c6505b72142e1976f898f7acf064beb27e35d2993ace09c
2026-08-29T06:05:49.9015347Z GATED OK: bring-up: B's suspended C-2 row replicated to A
2026-08-29T06:05:50.0503360Z GATED OK: C-2 wake dispatched — WOKE:ling-gated-c2@989b0dbaa74de8e5c747af19c65f49211f08235717e8d322ec082ab0cbfb48ee (Suspended->Active) at 989b0dbaa74de8e5c747af19c65f49211f08235717e8d322ec082ab0cbfb48ee
2026-08-29T06:06:20.8719709Z GATED OK: C-2: B's row advertises Active (the revive completed the loop)
2026-08-29T06:06:20.8735782Z 
2026-08-29T06:06:20.8736052Z GATED OK: E-1: B's send landed in the target spool
2026-08-29T06:06:20.8736389Z thread 'gated_cli_role_a' (44500) panicked at crates\spt\tests\twohost_cli.rs:1156:5:
2026-08-29T06:06:20.8736789Z assertion `left == right` failed: the from-stamp is the sender endpoint's own id (parent_pid leg), never the cli origin
2026-08-29T06:06:20.8737102Z   left: "cli@KITSUBITO"
2026-08-29T06:06:20.8738306Z  right: "ling-gated-e1"
2026-08-29T06:06:20.8738515Z note: run with `RUST_BACKTRACE=1` environment variable to display a backtrace
2026-08-29T06:06:21.0560550Z test gated_cli_role_a ... FAILED
2026-08-29T06:06:21.0560806Z 
2026-08-29T06:06:21.0560889Z failures:
2026-08-29T06:06:21.0560988Z 
2026-08-29T06:06:21.0561057Z failures:
2026-08-29T06:06:21.0561216Z     gated_cli_role_a
2026-08-29T06:06:21.0561354Z 
2026-08-29T06:06:21.0561602Z test result: FAILED. 1 passed; 1 failed; 0 ignored; 0 measured; 0 filtered out; finished in 35.85s
2026-08-29T06:06:21.0562614Z 
2026-08-29T06:06:21.0584946Z error: test failed, to rerun pass `-p spt --test twohost_cli`
2026-08-29T06:06:21.0921254Z ##[error]Process completed with exit code 1.
